BDBM43579 3-(4-chlorophenyl)-1-methyl-N-(2-oxolanylmethyl)-5-thieno[2,3-c]pyrazolecarboxamide::3-(4-chlorophenyl)-1-methyl-N-(oxolan-2-ylmethyl)thieno[2,3-c]pyrazole-5-carboxamide::3-(4-chlorophenyl)-1-methyl-N-(tetrahydrofurfuryl)thieno[2,3-c]pyrazole-5-carboxamide::MLS000117284::SMR000094234::cid_5307848
SMILES Cn1nc(-c2ccc(Cl)cc2)c2cc(sc12)C(=O)NCC1CCCO1
InChI Key InChIKey=PYJPAEPWXQGLJF-UHFFFAOYSA-N
Data  1 IC50  1 EC50
  Tab Delimited (TSV)   2D SDfile   Computed 3D by Vconf -m prep SDfile
Find this compound or compounds like it in BindingDB:
Activity Spreadsheet -- Enzyme Inhibition Constant Data from BindingDB
Found 2 hits for monomerid = 43579
TargetSignal transducer and activator of transcription 1-alpha/beta(Homo sapiens (Human))
The Scripps Research Institute Molecular Screening Center
Curated by PubChem BioAssay
LigandPNGBDBM43579(3-(4-chlorophenyl)-1-methyl-N-(2-oxolanylmethyl)-5...)
Affinity DataEC50: >5.57E+4nM. Assay description: Source (MLPCN Center Name): The Scripps Research Institute Molecular Screening Center Center Affiliation: The Scripps Research Institute (TSRI) Assay...
In DepthDetails PCBioAssay
TargetSignal transducer and activator of transcription 3 [702-738,740-752](Homo sapiens (Human))
The Scripps Research Institute Molecular Screening Center
Curated by PubChem BioAssay
LigandPNGBDBM43579(3-(4-chlorophenyl)-1-methyl-N-(2-oxolanylmethyl)-5...)
Affinity DataIC50: >6.19E+3nM. Assay description: Source (MLPCN Center Name): The Scripps Research Institute Molecular Screening Center Center Affiliation: The Scripps Research Institute (TSRI) Assay...
In DepthDetails PCBioAssay