BDBM43643 2-[2-(2-methoxybenzoyl)hydrazinyl]-N-(2-methoxyethyl)-2-oxoacetamide::2-keto-N-(2-methoxyethyl)-2-(N'-o-anisoylhydrazino)acetamide::MLS000711644::N-(2-methoxyethyl)-2-[2-(2-methoxyphenyl)carbonylhydrazinyl]-2-oxidanylidene-ethanamide::N-(2-methoxyethyl)-2-[[(2-methoxyphenyl)-oxomethyl]hydrazo]-2-oxoacetamide::SMR000281411::cid_1926617
SMILES COCCNC(=O)C(=O)NNC(=O)c1ccccc1OC
InChI Key InChIKey=CWHSVOUFCFSKDU-UHFFFAOYSA-N
Data  1 IC50  1 EC50
  Tab Delimited (TSV)   2D SDfile   Computed 3D by Vconf -m prep SDfile
Find this compound or compounds like it in BindingDB:
Activity Spreadsheet -- Enzyme Inhibition Constant Data from BindingDB
Found 2 hits for monomerid = 43643
TargetSignal transducer and activator of transcription 1-alpha/beta(Homo sapiens (Human))
The Scripps Research Institute Molecular Screening Center
Curated by PubChem BioAssay
LigandPNGBDBM43643(2-[2-(2-methoxybenzoyl)hydrazinyl]-N-(2-methoxyeth...)
Affinity DataEC50: >5.57E+4nM. Assay description: Source (MLPCN Center Name): The Scripps Research Institute Molecular Screening Center Center Affiliation: The Scripps Research Institute (TSRI) Assay...
In DepthDetails PCBioAssay
TargetSignal transducer and activator of transcription 3 [702-738,740-752](Homo sapiens (Human))
The Scripps Research Institute Molecular Screening Center
Curated by PubChem BioAssay
LigandPNGBDBM43643(2-[2-(2-methoxybenzoyl)hydrazinyl]-N-(2-methoxyeth...)
Affinity DataIC50:  1.47E+4nM. Assay description: Source (MLPCN Center Name): The Scripps Research Institute Molecular Screening Center Center Affiliation: The Scripps Research Institute (TSRI) Assay...
In DepthDetails PCBioAssay