BDBM43649 2-chloranyl-N-(3-methyl-2-oxidanyl-phenyl)-5-nitro-benzamide::2-chloro-N-(2-hydroxy-3-methyl-phenyl)-5-nitro-benzamide::2-chloro-N-(2-hydroxy-3-methylphenyl)-5-nitrobenzamide::2-chloro-N-(2-hydroxy-3-methylphenyl)-5-nitrobenzenecarboxamide::MLS000736090::SMR000338640::cid_3797106
SMILES Cc1cccc(NC(=O)c2cc(ccc2Cl)[N+]([O-])=O)c1O
InChI Key InChIKey=BGULFGKRTYKBSQ-UHFFFAOYSA-N
Data  1 IC50  1 EC50
  Tab Delimited (TSV)   2D SDfile   Computed 3D by Vconf -m prep SDfile
Find this compound or compounds like it in BindingDB:
Activity Spreadsheet -- Enzyme Inhibition Constant Data from BindingDB
Found 2 hits for monomerid = 43649
TargetSignal transducer and activator of transcription 1-alpha/beta(Homo sapiens (Human))
The Scripps Research Institute Molecular Screening Center
Curated by PubChem BioAssay
LigandPNGBDBM43649(2-chloranyl-N-(3-methyl-2-oxidanyl-phenyl)-5-nitro...)
Affinity DataEC50: >5.57E+4nM. Assay description: Source (MLPCN Center Name): The Scripps Research Institute Molecular Screening Center Center Affiliation: The Scripps Research Institute (TSRI) Assay...
In DepthDetails PCBioAssay
TargetSignal transducer and activator of transcription 3 [702-738,740-752](Homo sapiens (Human))
The Scripps Research Institute Molecular Screening Center
Curated by PubChem BioAssay
LigandPNGBDBM43649(2-chloranyl-N-(3-methyl-2-oxidanyl-phenyl)-5-nitro...)
Affinity DataIC50: >6.19E+3nM. Assay description: Source (MLPCN Center Name): The Scripps Research Institute Molecular Screening Center Center Affiliation: The Scripps Research Institute (TSRI) Assay...
In DepthDetails PCBioAssay