BDBM43677 5-methyl-N-(4,5,6,7-tetrahydro-1,3-benzothiazol-2-yl)-2-furamide::5-methyl-N-(4,5,6,7-tetrahydro-1,3-benzothiazol-2-yl)-2-furancarboxamide::5-methyl-N-(4,5,6,7-tetrahydro-1,3-benzothiazol-2-yl)furan-2-carboxamide::MLS000065569::SMR000080193::cid_841544
SMILES Cc1ccc(o1)C(=O)Nc1nc2CCCCc2s1
InChI Key InChIKey=HHHKLXMFVXBOOO-UHFFFAOYSA-N
Data  3 EC50
  Tab Delimited (TSV)   2D SDfile   Computed 3D by Vconf -m prep SDfile
Find this compound or compounds like it in BindingDB:
Activity Spreadsheet -- Enzyme Inhibition Constant Data from BindingDB
Found 3 hits for monomerid = 43677
TargetSignal transducer and activator of transcription 3 [702-738,740-752](Homo sapiens (Human))
The Scripps Research Institute Molecular Screening Center
Curated by PubChem BioAssay
LigandPNGBDBM43677(5-methyl-N-(4,5,6,7-tetrahydro-1,3-benzothiazol-2-...)
Affinity DataEC50: >5.57E+4nM. Assay description: Source (MLPCN Center Name): The Scripps Research Institute Molecular Screening Center Center Affiliation: The Scripps Research Institute (TSRI) Assay...
In DepthDetails PCBioAssay
TargetTranscription factor p65(Homo sapiens (Human))
Srmlsc
Curated by PubChem BioAssay
LigandPNGBDBM43677(5-methyl-N-(4,5,6,7-tetrahydro-1,3-benzothiazol-2-...)
Affinity DataEC50:  1.78E+3nM. Assay description: Southern Research Molecular Libraries Screening Center (SRMLSC) Southern Research Institute (Birmingham, Alabama) NIH Molecular Libraries Screening C...
In DepthDetails PCBioAssay
TargetMatrix metalloproteinase-14 [1-36](Homo sapiens (Human))
Sanford-Burnham Center For Chemical Genomics
Curated by PubChem BioAssay
LigandPNGBDBM43677(5-methyl-N-(4,5,6,7-tetrahydro-1,3-benzothiazol-2-...)
Affinity DataEC50:  5.98E+3nM. Assay description: Data Source: Sanford-Burnham Center for Chemical Genomics (SBCCG) Source Affiliation: Sanford-Burnham Medical Research Institute (SBMRI, San Diego, C...
In DepthDetails PCBioAssay