BDBM43679 2-pyridylmethyl(2-quinolyl)amine::MLS000107676::N-(2-pyridinylmethyl)-2-quinolinamine::N-(pyridin-2-ylmethyl)quinolin-2-amine::SMR000103641::cid_873112
SMILES C(Nc1ccc2ccccc2n1)c1ccccn1
InChI Key InChIKey=VFUXRFAJURRKPW-UHFFFAOYSA-N
Data  1 EC50
  Tab Delimited (TSV)   2D SDfile   Computed 3D by Vconf -m prep SDfile
Find this compound or compounds like it in BindingDB:
Activity Spreadsheet -- Enzyme Inhibition Constant Data from BindingDB
Found 1 hit for monomerid = 43679
TargetSignal transducer and activator of transcription 3 [702-738,740-752](Homo sapiens (Human))
The Scripps Research Institute Molecular Screening Center
Curated by PubChem BioAssay
LigandPNGBDBM43679(2-pyridylmethyl(2-quinolyl)amine | MLS000107676 | ...)
Affinity DataEC50: >5.57E+4nM. Assay description: Source (MLPCN Center Name): The Scripps Research Institute Molecular Screening Center Center Affiliation: The Scripps Research Institute (TSRI) Assay...
In DepthDetails PCBioAssay