BDBM43699 5-bromanyl-N-(2,3-dihydro-1,4-benzodioxin-6-yl)thiophene-2-carboxamide::5-bromo-N-(2,3-dihydro-1,4-benzodioxin-6-yl)-2-thiophenecarboxamide::5-bromo-N-(2,3-dihydro-1,4-benzodioxin-6-yl)thiophene-2-carboxamide::MLS000583240::SMR000201074::cid_1244355
SMILES Brc1ccc(s1)C(=O)Nc1ccc2OCCOc2c1
InChI Key InChIKey=NWYDYWIKCRKCTG-UHFFFAOYSA-N
Data  2 EC50
  Tab Delimited (TSV)   2D SDfile   Computed 3D by Vconf -m prep SDfile
Find this compound or compounds like it in BindingDB:
Activity Spreadsheet -- Enzyme Inhibition Constant Data from BindingDB
Found 2 hits for monomerid = 43699
TargetTranscription factor p65(Homo sapiens (Human))
Srmlsc
Curated by PubChem BioAssay
LigandPNGBDBM43699(5-bromanyl-N-(2,3-dihydro-1,4-benzodioxin-6-yl)thi...)
Affinity DataEC50:  609nM. Assay description: Southern Research Molecular Libraries Screening Center (SRMLSC) Southern Research Institute (Birmingham, Alabama) NIH Molecular Libraries Screening C...
In DepthDetails PCBioAssay
TargetSignal transducer and activator of transcription 3 [702-738,740-752](Homo sapiens (Human))
The Scripps Research Institute Molecular Screening Center
Curated by PubChem BioAssay
LigandPNGBDBM43699(5-bromanyl-N-(2,3-dihydro-1,4-benzodioxin-6-yl)thi...)
Affinity DataEC50: >5.57E+4nM. Assay description: Source (MLPCN Center Name): The Scripps Research Institute Molecular Screening Center Center Affiliation: The Scripps Research Institute (TSRI) Assay...
In DepthDetails PCBioAssay