BDBM43745 MLS000689575::N-(4-ethylphenyl)-3-phenyl-1-pyrrolidinecarboxamide::N-(4-ethylphenyl)-3-phenyl-pyrrolidine-1-carboxamide::N-(4-ethylphenyl)-3-phenylpyrrolidine-1-carboxamide::SMR000311613::cid_5065353
SMILES CCc1ccc(NC(=O)N2CCC(C2)c2ccccc2)cc1
InChI Key InChIKey=KMPKKZLJZWYYRQ-UHFFFAOYSA-N
Data  1 EC50
  Tab Delimited (TSV)   2D SDfile   Computed 3D by Vconf -m prep SDfile
Find this compound or compounds like it in BindingDB:
Activity Spreadsheet -- Enzyme Inhibition Constant Data from BindingDB
Found 1 hit for monomerid = 43745
TargetSignal transducer and activator of transcription 3 [702-738,740-752](Homo sapiens (Human))
The Scripps Research Institute Molecular Screening Center
Curated by PubChem BioAssay
LigandPNGBDBM43745(MLS000689575 | N-(4-ethylphenyl)-3-phenyl-1-pyrrol...)
Affinity DataEC50: >5.57E+4nM. Assay description: Source (MLPCN Center Name): The Scripps Research Institute Molecular Screening Center Center Affiliation: The Scripps Research Institute (TSRI) Assay...
In DepthDetails PCBioAssay