BDBM43761 2-methoxy-5-[2-(2-naphthoyl)carbohydrazonoyl]phenyl 4-(acetylamino)benzenesulfonate::4-acetamidobenzenesulfonic acid [2-methoxy-5-[(2-naphthoylhydrazono)methyl]phenyl] ester::4-acetamidobenzenesulfonic acid [2-methoxy-5-[[[2-naphthalenyl(oxo)methyl]hydrazinylidene]methyl]phenyl] ester::MLS000541168::SMR000160961::[2-methoxy-5-[(naphthalen-2-ylcarbonylhydrazinylidene)methyl]phenyl] 4-acetamidobenzenesulfonate::[2-methoxy-5-[(naphthalene-2-carbonylhydrazinylidene)methyl]phenyl] 4-acetamidobenzenesulfonate::cid_4384243
SMILES COc1ccc(C=NNC(=O)c2ccc3ccccc3c2)cc1OS(=O)(=O)c1ccc(NC(C)=O)cc1
InChI Key InChIKey=ZNMWIEZYWYQUIH-UHFFFAOYSA-N
Data  2 EC50
  Tab Delimited (TSV)   2D SDfile   Computed 3D by Vconf -m prep SDfile
Find this compound or compounds like it in BindingDB:
Activity Spreadsheet -- Enzyme Inhibition Constant Data from BindingDB
Found 2 hits for monomerid = 43761
TargetG2/mitotic-specific cyclin-B1(Homo sapiens (Human))
The Scripps Research Institute Molecular Screening Center
Curated by PubChem BioAssay
LigandPNGBDBM43761(2-methoxy-5-[2-(2-naphthoyl)carbohydrazonoyl]pheny...)
Affinity DataEC50: >4.98E+4nM. Assay description: Source (MLPCN Center Name): The Scripps Research Institute Molecular Screening Center Center Affiliation: The Scripps Research Institute (TSRI) Assay...
In DepthDetails PCBioAssay
TargetWee1-like protein kinase(Homo sapiens (Human))
The Scripps Research Institute Molecular Screening Center
Curated by PubChem BioAssay
LigandPNGBDBM43761(2-methoxy-5-[2-(2-naphthoyl)carbohydrazonoyl]pheny...)
Affinity DataEC50: >4.98E+4nM. Assay description: Source (MLPCN Center Name): The Scripps Research Institute Molecular Screening Center Center Affiliation: The Scripps Research Institute (TSRI) Assay...
In DepthDetails PCBioAssay