BDBM437683 US10617706, Example 117
SMILES OC(=O)c1cccc(COc2ccc(cc2)N2C3NC(=O)NC(=O)C3=Cc3ccc(cc23)C#N)c1
InChI Key InChIKey=JGYVZMXFTJJBEK-UHFFFAOYSA-N
Data  1 IC50
  Tab Delimited (TSV)   2D SDfile   Computed 3D by Vconf -m prep SDfile
Find this compound or compounds like it in BindingDB:
Activity Spreadsheet -- Enzyme Inhibition Constant Data from BindingDB
Found 1 hit for monomerid = 437683
TargetTyrosyl-DNA phosphodiesterase 2(Homo sapiens (Human))
Regents Of The University Of Minnesota
US Patent
LigandPNGBDBM437683(US10617706, Example 117)
Affinity DataIC50:  131nM. Assay description: The enzymatic activity of TDP2 was measured with a SUMO hTDP2cat fluorescence-based biochemical assay. To a black 384-well plate, 10 μL of compo...
Ligand InfoPC cidPC sid
In DepthDetails US Patent