BDBM43860 Glycopeptide, 2::MLS000517385::N-(4-acetamidophenyl)-6-chloranyl-pyridine-3-carboxamide::N-(4-acetamidophenyl)-6-chloro-3-pyridinecarboxamide::N-(4-acetamidophenyl)-6-chloro-nicotinamide::N-(4-acetamidophenyl)-6-chloropyridine-3-carboxamide::SMR000343444::cid_2121893
SMILES CC(=O)Nc1ccc(NC(=O)c2ccc(Cl)nc2)cc1
InChI Key InChIKey=ZEDHYTUJIWITOZ-UHFFFAOYSA-N
Data  1 KI  1 IC50
  Tab Delimited (TSV)   2D SDfile   Computed 3D by Vconf -m prep SDfile
Find this compound or compounds like it in BindingDB:
Activity Spreadsheet -- Enzyme Inhibition Constant Data from BindingDB
Found 2 hits for monomerid = 43860
TargetDolichyl-diphosphooligosaccharide--protein glycosyltransferase subunit 1(Saccharomyces cerevisiae (Baker's yeast))
Massachusetts Institute Of Technology
LigandPNGBDBM43860(Glycopeptide, 2 | MLS000517385 | N-(4-acetamidophe...)
Affinity DataKi:  2.50E+3nM ΔG°:  -7.00kcal/molepH: 7.5 T: 2°C. Assay description: Competition assay using S. cerevisiae oligosaccharyl transferase (OT)with disaccharide donor Dol-P-P-(GlcNAc)2 and the tripeptide substrate Bz-Asn-Le...
In DepthDetails ArticlePubMed
TargetDNA repair protein RAD51 homolog 1(Homo sapiens (Human))
Pcmd
Curated by PubChem BioAssay
LigandPNGBDBM43860(Glycopeptide, 2 | MLS000517385 | N-(4-acetamidophe...)
Affinity DataIC50:  5.30E+4nM. Assay description: Project Title: A screen for modulators of human Rad51, a key DNA repair protein Application Number: MH084119 Assay Submitter: Dr. Alex Mazin Submitte...
In DepthDetails PCBioAssay