BDBM43912 2-(1-Methyl-1H-benzoimidazol-2-ylmethylsulfanyl)-benzothiazole::2-[(1-methyl-2-benzimidazolyl)methylthio]-1,3-benzothiazole::2-[(1-methylbenzimidazol-2-yl)methylsulfanyl]-1,3-benzothiazole::2-[(1-methylbenzimidazol-2-yl)methylthio]-1,3-benzothiazole::MLS000030629::SMR000010207::cid_647349
SMILES Cn1c(CSc2nc3ccccc3s2)nc2ccccc12
InChI Key InChIKey=HKWHBXMJRSNVSG-UHFFFAOYSA-N
Data  4 EC50
  Tab Delimited (TSV)   2D SDfile   Computed 3D by Vconf -m prep SDfile
Find this compound or compounds like it in BindingDB:
Activity Spreadsheet -- Enzyme Inhibition Constant Data from BindingDB
Found 4 hits for monomerid = 43912
TargetSolute carrier family 12 member 5(Homo sapiens (Human))
Vanderbilt Screening Center For Gpcrs, Ion Channels And Transporters
Curated by PubChem BioAssay
LigandPNGBDBM43912(2-(1-Methyl-1H-benzoimidazol-2-ylmethylsulfanyl)-b...)
Affinity DataEC50:  1.48E+4nM. Assay description: Vanderbilt Screening Center for GPCRs, Ion Channels and Transporters Assay Provider: Eric Delpire Assay Provider Affliation: Vanderbilt University Gr...
In DepthDetails PCBioAssay
TargetVoltage-dependent T-type calcium channel subunit alpha-1H(Homo sapiens (Human))
Vanderbilt Screening Center For Gpcrs, Ion Channels And Transporters
Curated by PubChem BioAssay
LigandPNGBDBM43912(2-(1-Methyl-1H-benzoimidazol-2-ylmethylsulfanyl)-b...)
Affinity DataEC50:  1.74E+4nM. Assay description: Assay Provider: Xinmin Xie Assay Provider Affiliation: Bioscience Division, SRI International, Menlo Park, CA Grant Title: HTS Assay for Cav3 T-Type ...
In DepthDetails PCBioAssay
TargetSolute carrier family 12 member 5(Homo sapiens (Human))
Vanderbilt Screening Center For Gpcrs, Ion Channels And Transporters
Curated by PubChem BioAssay
LigandPNGBDBM43912(2-(1-Methyl-1H-benzoimidazol-2-ylmethylsulfanyl)-b...)
Affinity DataEC50:  4.39E+5nM. Assay description: Vanderbilt Screening Center for GPCRs, Ion Channels and Transporters Assay Provider: Eric Delpire Assay Provider Affliation: Vanderbilt University Gr...
In DepthDetails PCBioAssay
TargetSolute carrier family 12 member 5(Homo sapiens (Human))
Vanderbilt Screening Center For Gpcrs, Ion Channels And Transporters
Curated by PubChem BioAssay
LigandPNGBDBM43912(2-(1-Methyl-1H-benzoimidazol-2-ylmethylsulfanyl)-b...)
Affinity DataEC50:  1.24E+4nM. Assay description: Vanderbilt Screening Center for GPCRs, Ion Channels and Transporters Assay Provider: Eric Delpire Assay Provider Affliation: Vanderbilt University Gr...
In DepthDetails PCBioAssay