BDBM44158 1-(4-fluorophenyl)-2-[[5-(phenylmethyl)-1,3,4-oxadiazol-2-yl]sulfanyl]ethanone::1-(4-fluorophenyl)-2-[[5-(phenylmethyl)-1,3,4-oxadiazol-2-yl]thio]ethanone::2-(5-Benzyl-[1,3,4]oxadiazol-2-ylsulfanyl)-1-(4-fluoro-phenyl)-ethanone::2-[(5-benzyl-1,3,4-oxadiazol-2-yl)sulfanyl]-1-(4-fluorophenyl)ethanone::2-[(5-benzyl-1,3,4-oxadiazol-2-yl)thio]-1-(4-fluorophenyl)ethanone::MLS001012246::SMR000424854::cid_4361643
SMILES Fc1ccc(cc1)C(=O)CSc1nnc(Cc2ccccc2)o1
InChI Key InChIKey=HZPBZXJTKYQVCY-UHFFFAOYSA-N
Data  3 EC50
  Tab Delimited (TSV)   2D SDfile   Computed 3D by Vconf -m prep SDfile
Find this compound or compounds like it in BindingDB:
Activity Spreadsheet -- Enzyme Inhibition Constant Data from BindingDB
Found 3 hits for monomerid = 44158
TargetSolute carrier family 12 member 5(Homo sapiens (Human))
Vanderbilt Screening Center For Gpcrs, Ion Channels And Transporters
Curated by PubChem BioAssay
LigandPNGBDBM44158(1-(4-fluorophenyl)-2-[[5-(phenylmethyl)-1,3,4-oxad...)
Affinity DataEC50:  3.85E+3nM. Assay description: Vanderbilt Screening Center for GPCRs, Ion Channels and Transporters Assay Provider: Eric Delpire Assay Provider Affliation: Vanderbilt University Gr...
In DepthDetails PCBioAssay
TargetSolute carrier family 12 member 5(Homo sapiens (Human))
Vanderbilt Screening Center For Gpcrs, Ion Channels And Transporters
Curated by PubChem BioAssay
LigandPNGBDBM44158(1-(4-fluorophenyl)-2-[[5-(phenylmethyl)-1,3,4-oxad...)
Affinity DataEC50:  2.86E+3nM. Assay description: Vanderbilt Screening Center for GPCRs, Ion Channels and Transporters Assay Provider: Eric Delpire Assay Provider Affliation: Vanderbilt University Gr...
In DepthDetails PCBioAssay
TargetSolute carrier family 12 member 5(Homo sapiens (Human))
Vanderbilt Screening Center For Gpcrs, Ion Channels And Transporters
Curated by PubChem BioAssay
LigandPNGBDBM44158(1-(4-fluorophenyl)-2-[[5-(phenylmethyl)-1,3,4-oxad...)
Affinity DataEC50:  2.39E+3nM. Assay description: Vanderbilt Screening Center for GPCRs, Ion Channels and Transporters Assay Provider: Eric Delpire Assay Provider Affliation: Vanderbilt University Gr...
In DepthDetails PCBioAssay