BDBM441845 US10647665, Example 1-31::US10851050, Example I-31
SMILES Cc1cc(CNC(=O)Nc2cc(Cl)c(c(Cl)c2)-c2ccccc2OC(F)(F)F)ccc1CC(O)=O
InChI Key InChIKey=VDGDKXGGTMPHEL-UHFFFAOYSA-N
Data  3 IC50
  Tab Delimited (TSV)   2D SDfile   Computed 3D by Vconf -m prep SDfile
Find this compound or compounds like it in BindingDB:
Activity Spreadsheet -- Enzyme Inhibition Constant Data from BindingDB
Found 3 hits for monomerid = 441845
TargetNuclear receptor ROR-gamma(Homo sapiens (Human))
Fudan University
US Patent
LigandPNGBDBM441845(US10647665, Example 1-31 | US10851050, Example I-3...)
Affinity DataIC50:  2.75E+3nM. Assay description: 1. Preparation of RORgamma Buffer Solution10 mL of DTT and 100 mL buffer solution were gently mixed together and ready to use.2. Preparation of Compo...
Ligand InfoPC cidPC sid
In DepthDetails US Patent
TargetNuclear receptor ROR-gamma(Homo sapiens (Human))
Fudan University
US Patent
LigandPNGBDBM441845(US10647665, Example 1-31 | US10851050, Example I-3...)
Affinity DataIC50:  996nM. Assay description: Inverse agonist activity at human RORgammat assessed as inhibition of N-terminal biotinylated co-activator SRC1 recruitment measured after 60 mins by...
Ligand InfoPC cidPC sid
In DepthDetails ArticlePubMed
TargetNuclear receptor ROR-gamma(Homo sapiens (Human))
Fudan University
US Patent
LigandPNGBDBM441845(US10647665, Example 1-31 | US10851050, Example I-3...)
Affinity DataIC50:  2.75E+3nM. Assay description: The inhibitory activity of compounds on RORγ receptor was determined by fluorescence resonance energy transfer (FRET) experiments. The inhibitor...
Ligand InfoPC cidPC sid
In DepthDetails US Patent