BDBM44198 1-({1-[(3,5-dimethylisoxazol-4-yl)sulfonyl]piperidin-4-yl}carbonyl)-4-(4-fluorophenyl)piperazine::MLS000091475::SMR000026030::[1-(3,5-dimethylisoxazol-4-yl)sulfonyl-4-piperidyl]-[4-(4-fluorophenyl)piperazino]methanone::[1-[(3,5-dimethyl-1,2-oxazol-4-yl)sulfonyl]piperidin-4-yl]-[4-(4-fluorophenyl)piperazin-1-yl]methanone::[1-[(3,5-dimethyl-4-isoxazolyl)sulfonyl]-4-piperidinyl]-[4-(4-fluorophenyl)-1-piperazinyl]methanone::cid_3245224
SMILES Cc1noc(C)c1S(=O)(=O)N1CCC(CC1)C(=O)N1CCN(CC1)c1ccc(F)cc1
InChI Key InChIKey=OLPKAORPEYUDSU-UHFFFAOYSA-N
Data  3 EC50
  Tab Delimited (TSV)   2D SDfile   Computed 3D by Vconf -m prep SDfile
Find this compound or compounds like it in BindingDB:
Activity Spreadsheet -- Enzyme Inhibition Constant Data from BindingDB
Found 3 hits for monomerid = 44198
TargetSolute carrier family 12 member 5(Homo sapiens (Human))
Vanderbilt Screening Center For Gpcrs, Ion Channels And Transporters
Curated by PubChem BioAssay
LigandPNGBDBM44198(1-({1-[(3,5-dimethylisoxazol-4-yl)sulfonyl]piperid...)
Affinity DataEC50:  7.58E+3nM. Assay description: Vanderbilt Screening Center for GPCRs, Ion Channels and Transporters Assay Provider: Eric Delpire Assay Provider Affliation: Vanderbilt University Gr...
In DepthDetails PCBioAssay
TargetCorticotropin-releasing factor-binding protein(Homo sapiens (Human))
Burnham Center For Chemical Genomics
Curated by PubChem BioAssay
LigandPNGBDBM44198(1-({1-[(3,5-dimethylisoxazol-4-yl)sulfonyl]piperid...)
Affinity DataEC50: >5.30E+4nM. Assay description: Data Source: Sanford-Burnham Center for Chemical Genomics (SBCCG) Source Affiliation: Sanford-Burnham Medical Research Institute (SBMRI, San Diego, C...
In DepthDetails PCBioAssay
TargetSolute carrier family 12 member 5(Homo sapiens (Human))
Vanderbilt Screening Center For Gpcrs, Ion Channels And Transporters
Curated by PubChem BioAssay
LigandPNGBDBM44198(1-({1-[(3,5-dimethylisoxazol-4-yl)sulfonyl]piperid...)
Affinity DataEC50:  2.31E+4nM. Assay description: Vanderbilt Screening Center for GPCRs, Ion Channels and Transporters Assay Provider: Eric Delpire Assay Provider Affliation: Vanderbilt University Gr...
In DepthDetails PCBioAssay