BDBM44262 MLS-0390973.0001::benzyl (2S)-1-[(2S)-3-methyl-2-[[(2S)-2-(methylamino)propanoyl]amino]butanoyl]pyrrolidine-2-carboxylate;formic acid::cid_25241635::formic acid;(2S)-1-[(2S)-3-methyl-2-[[(2S)-2-(methylamino)-1-oxopropyl]amino]-1-oxobutyl]-2-pyrrolidinecarboxylic acid (phenylmethyl) ester::formic acid;(2S)-1-[(2S)-3-methyl-2-[[(2S)-2-(methylamino)propanoyl]amino]butanoyl]pyrrolidine-2-carboxylic acid benzyl ester::methanoic acid;(phenylmethyl) (2S)-1-[(2S)-3-methyl-2-[[(2S)-2-(methylamino)propanoyl]amino]butanoyl]pyrrolidine-2-carboxylate
SMILES CN[C@@H](C)C(=O)N[C@@H](C(C)C)C(=O)N1CCC[C@H]1C(=O)OCc1ccccc1
InChI Key InChIKey=XDHLZIJPULNRDK-SZMVWBNQSA-N
Data  2 IC50
  Tab Delimited (TSV)   2D SDfile   Computed 3D by Vconf -m prep SDfile
Find this compound or compounds like it in BindingDB:
Activity Spreadsheet -- Enzyme Inhibition Constant Data from BindingDB
Found 2 hits for monomerid = 44262
TargetE3 ubiquitin-protein ligase XIAP(Homo sapiens (Human))
Burnham Center For Chemical Genomics
Curated by PubChem BioAssay
LigandPNGBDBM44262(MLS-0390973.0001 | benzyl (2S)-1-[(2S)-3-methyl-2-...)
Affinity DataIC50:  1.07E+3nM. Assay description: Data Source: Sanford-Burnham Center for Chemical Genomics (SBCCG) Source Affiliation: Sanford-Burnham Medical Research Institute (SBMRI, San Diego, C...
In DepthDetails PCBioAssay
TargetE3 ubiquitin-protein ligase XIAP(Homo sapiens (Human))
Burnham Center For Chemical Genomics
Curated by PubChem BioAssay
LigandPNGBDBM44262(MLS-0390973.0001 | benzyl (2S)-1-[(2S)-3-methyl-2-...)
Affinity DataIC50:  2.26E+4nM. Assay description: Data Source: Sanford-Burnham Center for Chemical Genomics (SBCCG) Source Affiliation: Sanford-Burnham Medical Research Institute (SBMRI, San Diego, C...
In DepthDetails PCBioAssay