BDBM442785 N7-{(1R)-1-[3-Fluoro-4-(trifluoromethyl)phenyl]-2,2-dimethylpropyl}-5-methylpyrazolo[1,5-a]pyrimidine-3,7-diamine::US10647727, Example 42
SMILES Cc1cc(N[C@@H](c2ccc(c(F)c2)C(F)(F)F)C(C)(C)C)n2ncc(N)c2n1
InChI Key InChIKey=JRMWSSWQYCEOHC-INIZCTEOSA-N
Data  1 KI
  Tab Delimited (TSV)   2D SDfile   Computed 3D by Vconf -m prep SDfile
Find this compound or compounds like it in BindingDB:
Activity Spreadsheet -- Enzyme Inhibition Constant Data from BindingDB
Found 1 hit for monomerid = 442785
TargetcGMP-dependent 3',5'-cyclic phosphodiesterase(Homo sapiens (Human))
Merck Sharp & Dohme
US Patent
LigandPNGBDBM442785(N7-{(1R)-1-[3-Fluoro-4-(trifluoromethyl)phenyl]-2,...)
Affinity DataKi:  580nM. Assay description: In a typical experiment the PDE2 inhibitory activity of the compounds of the present invention was determined in accordance with the following experi...
Ligand InfoPC cidPC sid
In DepthDetails US Patent