BDBM44363 MLS-0390988.0001::cid_25241649::formic acid;(2S)-1-[(2R)-3-methyl-2-[[(2S)-2-(methylamino)-1-oxopropyl]amino]-1-oxobutyl]-N-(1-naphthalenyl)-2-pyrrolidinecarboxamide::formic acid;(2S)-1-[(2R)-3-methyl-2-[[(2S)-2-(methylamino)propanoyl]amino]butanoyl]-N-(1-naphthyl)pyrrolidine-2-carboxamide::formic acid;(2S)-1-[(2R)-3-methyl-2-[[(2S)-2-(methylamino)propanoyl]amino]butanoyl]-N-naphthalen-1-ylpyrrolidine-2-carboxamide::methanoic acid;(2S)-1-[(2R)-3-methyl-2-[[(2S)-2-(methylamino)propanoyl]amino]butanoyl]-N-naphthalen-1-yl-pyrrolidine-2-carboxamide
SMILES CN[C@@H](C)C(=O)N[C@H](C(C)C)C(=O)N1CCC[C@H]1C(=O)Nc1cccc2ccccc12
InChI Key InChIKey=FLKHNUHOOQHJNR-ORYQWCPZSA-N
Data  1 IC50
  Tab Delimited (TSV)   2D SDfile   Computed 3D by Vconf -m prep SDfile
Find this compound or compounds like it in BindingDB:
Activity Spreadsheet -- Enzyme Inhibition Constant Data from BindingDB
Found 1 hit for monomerid = 44363
TargetE3 ubiquitin-protein ligase XIAP(Homo sapiens (Human))
Burnham Center For Chemical Genomics
Curated by PubChem BioAssay
LigandPNGBDBM44363(MLS-0390988.0001 | cid_25241649 | formic acid;(2S)...)
Affinity DataIC50:  3.60E+4nM. Assay description: Data Source: Sanford-Burnham Center for Chemical Genomics (SBCCG) Source Affiliation: Sanford-Burnham Medical Research Institute (SBMRI, San Diego, C...
In DepthDetails PCBioAssay