BDBM44373 2-[4-phenyl-6-(trifluoromethyl)pyrimidin-2-yl]sulfanyl-1-pyrrolidin-1-yl-propan-1-one::2-[4-phenyl-6-(trifluoromethyl)pyrimidin-2-yl]sulfanyl-1-pyrrolidin-1-ylpropan-1-one::2-[[4-phenyl-6-(trifluoromethyl)-2-pyrimidinyl]thio]-1-(1-pyrrolidinyl)-1-propanone::2-[[4-phenyl-6-(trifluoromethyl)pyrimidin-2-yl]thio]-1-pyrrolidino-propan-1-one::MLS-0011658.0001::cid_3145657
SMILES CC(Sc1nc(cc(n1)C(F)(F)F)-c1ccccc1)C(=O)N1CCCC1
InChI Key InChIKey=SMFHVUMOGMGCKT-UHFFFAOYSA-N
Data  2 IC50  1 EC50
  Tab Delimited (TSV)   2D SDfile   Computed 3D by Vconf -m prep SDfile
Find this compound or compounds like it in BindingDB:
Activity Spreadsheet -- Enzyme Inhibition Constant Data from BindingDB
Found 3 hits for monomerid = 44373
TargetTumor necrosis factor ligand superfamily member 10(Homo sapiens (Human))
Burnham Center For Chemical Genomics
Curated by PubChem BioAssay
LigandPNGBDBM44373(2-[4-phenyl-6-(trifluoromethyl)pyrimidin-2-yl]sulf...)
Affinity DataIC50: >1.00E+4nM. Assay description: Data Source: Sanford-Burnham Center for Chemical Genomics (SBCCG) Source Affiliation: Sanford-Burnham Medical Research Institute (SBMRI, San Diego, C...
In DepthDetails PCBioAssay
TargetBeta-2 adrenergic receptor(Homo sapiens (Human))
Nmmlsc
Curated by PubChem BioAssay
LigandPNGBDBM44373(2-[4-phenyl-6-(trifluoromethyl)pyrimidin-2-yl]sulf...)
Affinity DataEC50:  243nM. Assay description: University of New Mexico Assay Overview: Assay Support: R03 MH093192-01 Project Title: HTS for Non-Canonical Ligands for Beta 2 Adrenergic Receptor...
In DepthDetails PCBioAssay
TargetTumor necrosis factor ligand superfamily member 10(Homo sapiens (Human))
Burnham Center For Chemical Genomics
Curated by PubChem BioAssay
LigandPNGBDBM44373(2-[4-phenyl-6-(trifluoromethyl)pyrimidin-2-yl]sulf...)
Affinity DataIC50: >1.00E+4nM. Assay description: Data Source: Sanford-Burnham Center for Chemical Genomics (SBCCG) Source Affiliation: Sanford-Burnham Medical Research Institute (SBMRI, San Diego, C...
In DepthDetails PCBioAssay