BDBM44384 5-(4-Bromo-phenyl)-4-chloro-2H-pyrazol-3-ylamine::5-(4-bromophenyl)-4-chloranyl-1H-pyrazol-3-amine::5-(4-bromophenyl)-4-chloro-1H-pyrazol-3-amine::MLS000070364::SMR000012136::[5-(4-bromophenyl)-4-chloro-1H-pyrazol-3-yl]amine::cid_648672
SMILES Nc1[nH]nc(c1Cl)-c1ccc(Br)cc1
InChI Key InChIKey=WQZYELBBEZIEDT-UHFFFAOYSA-N
Data  1 IC50
  Tab Delimited (TSV)   2D SDfile   Computed 3D by Vconf -m prep SDfile
Find this compound or compounds like it in BindingDB:
Activity Spreadsheet -- Enzyme Inhibition Constant Data from BindingDB
Found 1 hit for monomerid = 44384
TargetAlkaline phosphatase, tissue-nonspecific isozyme(Homo sapiens (Human))
Burnham Center For Chemical Genomics
Curated by PubChem BioAssay
LigandPNGBDBM44384(5-(4-Bromo-phenyl)-4-chloro-2H-pyrazol-3-ylamine |...)
Affinity DataIC50:  6.51E+3nM. Assay description: Sanford-Burnham Center for Chemical Genomics (SBCCG) Sanford-Burnham Medical Research Institute (SBMRI, San Diego, CA) NIH Molecular Libraries Screen...
In DepthDetails PCBioAssay