BDBM44389 2-[[5-(2-methoxyphenyl)-1H-1,2,4-triazol-3-yl]sulfanylmethyl]pyridine::2-[[[5-(2-methoxyphenyl)-1H-1,2,4-triazol-3-yl]thio]methyl]pyridine::MLS000037668::SMR000037833::cid_661041
SMILES COc1ccccc1-c1nnc(SCc2ccccn2)[nH]1
InChI Key InChIKey=RQCAAYDCORTSQH-UHFFFAOYSA-N
Data  1 IC50
  Tab Delimited (TSV)   2D SDfile   Computed 3D by Vconf -m prep SDfile
Find this compound or compounds like it in BindingDB:
Activity Spreadsheet -- Enzyme Inhibition Constant Data from BindingDB
Found 1 hit for monomerid = 44389
TargetAlkaline phosphatase, tissue-nonspecific isozyme(Homo sapiens (Human))
Burnham Center For Chemical Genomics
Curated by PubChem BioAssay
LigandPNGBDBM44389(2-[[5-(2-methoxyphenyl)-1H-1,2,4-triazol-3-yl]sulf...)
Affinity DataIC50:  3.79E+3nM. Assay description: Sanford-Burnham Center for Chemical Genomics (SBCCG) Sanford-Burnham Medical Research Institute (SBMRI, San Diego, CA) NIH Molecular Libraries Screen...
In DepthDetails PCBioAssay