BDBM44441 MLS000098295::SMR000066971::cid_2998095
SMILES Cc1nn(c2N=C3C=CC(=CN3C(c12)c1cccnc1)S(=O)(=O)N1CCCCC1)-c1ccccc1
InChI Key InChIKey=WXIIMGMKPKXCJW-UHFFFAOYSA-N
Data  4 IC50
  Tab Delimited (TSV)   2D SDfile   Computed 3D by Vconf -m prep SDfile
Find this compound or compounds like it in BindingDB:
Activity Spreadsheet -- Enzyme Inhibition Constant Data from BindingDB
Found 4 hits for monomerid = 44441
TargetEphrin type-A receptor 4(Mus musculus)
Sanford-Burnham Center For Chemical Genomics
Curated by PubChem BioAssay
LigandPNGBDBM44441(MLS000098295 | SMR000066971 | cid_2998095)
Affinity DataIC50: >1.00E+5nM. Assay description: Data Source: Sanford-Burnham Center for Chemical Genomics (SBCCG) Source Affiliation: Sanford-Burnham Medical Research Institute (SBMRI, San Diego, C...
In DepthDetails PCBioAssay
TargetPhosphomannomutase 2(Homo sapiens (Human))
Sanford-Burnham Medical Research Institute
Curated by ChEMBL
LigandPNGBDBM44441(MLS000098295 | SMR000066971 | cid_2998095)
Affinity DataIC50:  1.54E+4nM. Assay description: Inhibition of human purified PMM2
In DepthDetails ArticlePubMed
TargetMannose-6-phosphate isomerase(Homo sapiens (Human))
Sanford-Burnham Medical Research Institute
Curated by ChEMBL
LigandPNGBDBM44441(MLS000098295 | SMR000066971 | cid_2998095)
Affinity DataIC50:  4.90E+3nM. Assay description: Inhibition of human purified phosphomannose isomerase
In DepthDetails ArticlePubMed
TargetEphrin type-A receptor 4(Mus musculus)
Sanford-Burnham Center For Chemical Genomics
Curated by PubChem BioAssay
LigandPNGBDBM44441(MLS000098295 | SMR000066971 | cid_2998095)
Affinity DataIC50: >5.00E+4nM. Assay description: Sanford-Burnham Center for Chemical Genomics (SBCCG) Sanford-Burnham Medical Research Institute (SBMRI, San Diego, CA) NIH Molecular Libraries Screen...
In DepthDetails PCBioAssay