BDBM44465 (Z)-2-dibutoxyphosphoryl-3-hydroxy-2-butenenitrile::(Z)-2-dibutoxyphosphoryl-3-hydroxy-but-2-enenitrile::(Z)-2-dibutoxyphosphoryl-3-hydroxybut-2-enenitrile::(Z)-2-dibutoxyphosphoryl-3-oxidanyl-but-2-enenitrile::MLS000532666::SMR000137605::cid_2828403::dibutyl (1-cyano-2-hydroxy-1-propen-1-yl)phosphonate
SMILES CCCCOP(=O)(OCCCC)C(C#N)C(C)=O
InChI Key InChIKey=GSHCGKOTEVSKNL-UHFFFAOYSA-N
Data  2 IC50
  Tab Delimited (TSV)   2D SDfile   Computed 3D by Vconf -m prep SDfile
Find this compound or compounds like it in BindingDB:
Activity Spreadsheet -- Enzyme Inhibition Constant Data from BindingDB
Found 2 hits for monomerid = 44465
TargetEphrin type-A receptor 4(Mus musculus)
Burnham Center For Chemical Genomics
Curated by PubChem BioAssay
LigandPNGBDBM44465((Z)-2-dibutoxyphosphoryl-3-hydroxy-2-butenenitrile...)
Affinity DataIC50: >5.00E+4nM. Assay description: Sanford-Burnham Center for Chemical Genomics (SBCCG) Sanford-Burnham Medical Research Institute (SBMRI, San Diego, CA) NIH Molecular Libraries Screen...
Ligand InfoPC cidPC sid
In DepthDetails PCBioAssay
TargetEphrin type-A receptor 4(Mus musculus)
Burnham Center For Chemical Genomics
Curated by PubChem BioAssay
LigandPNGBDBM44465((Z)-2-dibutoxyphosphoryl-3-hydroxy-2-butenenitrile...)
Affinity DataIC50: >1.00E+5nM. Assay description: Data Source: Sanford-Burnham Center for Chemical Genomics (SBCCG) Source Affiliation: Sanford-Burnham Medical Research Institute (SBMRI, San Diego, C...
Ligand InfoPC cidPC sid
In DepthDetails PCBioAssay