BDBM44470 (5Z)-2-(4-methylphenyl)-3-phenylazanyl-5-(thiophen-2-ylmethylidene)imidazol-4-one::(5Z)-3-anilino-2-(4-methylphenyl)-5-(thiophen-2-ylmethylidene)-4-imidazolone::(5Z)-3-anilino-2-(4-methylphenyl)-5-(thiophen-2-ylmethylidene)imidazol-4-one::(5Z)-3-anilino-2-(p-tolyl)-5-(2-thenylidene)-2-imidazolin-4-one::3-anilino-2-(4-methylphenyl)-5-(2-thienylmethylene)-3,5-dihydro-4H-imidazol-4-one::MLS000533585::SMR000141023::cid_1893499
SMILES Cc1ccc(cc1)C1=N\C(=C/c2cccs2)C(=O)N1Nc1ccccc1
InChI Key InChIKey=OCWSKBSKQSTJEH-RGEXLXHISA-N
Data  2 IC50
  Tab Delimited (TSV)   2D SDfile   Computed 3D by Vconf -m prep SDfile
Find this compound or compounds like it in BindingDB:
Activity Spreadsheet -- Enzyme Inhibition Constant Data from BindingDB
Found 2 hits for monomerid = 44470
TargetEphrin type-A receptor 4(Mus musculus)
Burnham Center For Chemical Genomics
Curated by PubChem BioAssay
LigandPNGBDBM44470((5Z)-2-(4-methylphenyl)-3-phenylazanyl-5-(thiophen...)
Affinity DataIC50: >5.00E+4nM. Assay description: Sanford-Burnham Center for Chemical Genomics (SBCCG) Sanford-Burnham Medical Research Institute (SBMRI, San Diego, CA) NIH Molecular Libraries Screen...
In DepthDetails PCBioAssay
TargetEphrin type-A receptor 4(Mus musculus)
Burnham Center For Chemical Genomics
Curated by PubChem BioAssay
LigandPNGBDBM44470((5Z)-2-(4-methylphenyl)-3-phenylazanyl-5-(thiophen...)
Affinity DataIC50:  2.91E+3nM. Assay description: Data Source: Sanford-Burnham Center for Chemical Genomics (SBCCG) Source Affiliation: Sanford-Burnham Medical Research Institute (SBMRI, San Diego, C...
In DepthDetails PCBioAssay