BDBM444737 (R)-1-(3-(3-(3'-methyl-[1,1'-biphenyl]- 4-yl)-1H-pyrazolo[4,3-c]pyridin-1- yl)pyrrolidin-1-yl)prop-2-en-1-one::US10662187, Compound 107::US10793566, Compound 107
SMILES Cc1cccc(c1)-c1ccc(cc1)-c1nn([C@@H]2CCN(C2)C(=O)C=C)c2ccncc12
InChI Key InChIKey=PTTONYDKQUGTAO-JOCHJYFZSA-N
Data  2 IC50
  Tab Delimited (TSV)   2D SDfile   Computed 3D by Vconf -m prep SDfile
Find this compound or compounds like it in BindingDB:
Activity Spreadsheet -- Enzyme Inhibition Constant Data from BindingDB
Found 2 hits for monomerid = 444737
TargetTyrosine-protein kinase BTK(Homo sapiens (Human))
Zibo Biopolar Changsheng Pharmaceutical
US Patent
LigandPNGBDBM444737((R)-1-(3-(3-(3'-methyl-[1,1'-biphenyl]- 4-yl)-1H-p...)
Affinity DataIC50:  55nM. Assay description: Btk kinase activity was determined using a homogenous time resolved fluorescence (HTRF) methodology. Measurements were performed in a reaction volume...
Ligand InfoPC cidPC sid
In DepthDetails US Patent
TargetTyrosine-protein kinase BTK(Homo sapiens (Human))
Zibo Biopolar Changsheng Pharmaceutical
US Patent
LigandPNGBDBM444737((R)-1-(3-(3-(3'-methyl-[1,1'-biphenyl]- 4-yl)-1H-p...)
Affinity DataIC50:  55nM. Assay description: Measurements were performed in a reaction volume of 15 μL using 384-well assay plates. Kinase enzyme, inhibitor, ATP and 1 μM peptide subst...
Ligand InfoPC cidPC sid
In DepthDetails US Patent