BDBM44495 3-(2-furyl)-1-(4-nitrophenyl)-5-phenyl-2-pyrazoline::3-(2-furyl)-1-{4-nitrophenyl}-5-phenyl-4,5-dihydro-1H-pyrazole::5-(2-furanyl)-2-(4-nitrophenyl)-3-phenyl-3,4-dihydropyrazole::5-(furan-2-yl)-2-(4-nitrophenyl)-3-phenyl-3,4-dihydropyrazole::MLS000544367::SMR000162870::cid_11948839
SMILES [O-][N+](=O)c1ccc(cc1)N1N=C(CC1c1ccccc1)c1ccco1
InChI Key InChIKey=ZYVHICVEXRPVAG-UHFFFAOYSA-N
Data  3 IC50
  Tab Delimited (TSV)   2D SDfile   Computed 3D by Vconf -m prep SDfile
Find this compound or compounds like it in BindingDB:
Activity Spreadsheet -- Enzyme Inhibition Constant Data from BindingDB
Found 3 hits for monomerid = 44495
TargetEphrin type-A receptor 4(Mus musculus)
Sanford-Burnham Center For Chemical Genomics
Curated by PubChem BioAssay
LigandPNGBDBM44495(3-(2-furyl)-1-(4-nitrophenyl)-5-phenyl-2-pyrazolin...)
Affinity DataIC50: >1.00E+5nM. Assay description: Data Source: Sanford-Burnham Center for Chemical Genomics (SBCCG) Source Affiliation: Sanford-Burnham Medical Research Institute (SBMRI, San Diego, C...
Ligand InfoPC cidPC sid
In DepthDetails PCBioAssay
TargetGlycoprotein 42(Human herpesvirus 4 type 2)
Emory University
Curated by PubChem BioAssay
LigandPNGBDBM44495(3-(2-furyl)-1-(4-nitrophenyl)-5-phenyl-2-pyrazolin...)
Affinity DataIC50:  5.61E+3nM. Assay description: NIH Molecular Libraries Screening Centers Network [MLSCN] Emory Chemical Biology Discovery Center in MLSCN Assay provider: Theodore Jardetzky; Northw...
Ligand InfoPC cidPC sid
In DepthDetails PCBioAssay
TargetEphrin type-A receptor 4(Mus musculus)
Sanford-Burnham Center For Chemical Genomics
Curated by PubChem BioAssay
LigandPNGBDBM44495(3-(2-furyl)-1-(4-nitrophenyl)-5-phenyl-2-pyrazolin...)
Affinity DataIC50: >5.00E+4nM. Assay description: Sanford-Burnham Center for Chemical Genomics (SBCCG) Sanford-Burnham Medical Research Institute (SBMRI, San Diego, CA) NIH Molecular Libraries Screen...
Ligand InfoPC cidPC sid
In DepthDetails PCBioAssay