BDBM44509 1,2-dimethoxy-9-thioxanthenone::1,2-dimethoxy-9H-thioxanthen-9-one::1,2-dimethoxythioxanthen-9-one::MLS000544435::SMR000161534::cid_4600956
SMILES COc1ccc2sc3ccccc3c(=O)c2c1OC
InChI Key InChIKey=LZAPWMRTQFPWQE-UHFFFAOYSA-N
Data  2 IC50
  Tab Delimited (TSV)   2D SDfile   Computed 3D by Vconf -m prep SDfile
Find this compound or compounds like it in BindingDB:
Activity Spreadsheet -- Enzyme Inhibition Constant Data from BindingDB
Found 2 hits for monomerid = 44509
TargetEphrin type-A receptor 4(Mus musculus)
Burnham Center For Chemical Genomics
Curated by PubChem BioAssay
LigandPNGBDBM44509(1,2-dimethoxy-9-thioxanthenone | 1,2-dimethoxy-9H-...)
Affinity DataIC50: >5.00E+4nM. Assay description: Sanford-Burnham Center for Chemical Genomics (SBCCG) Sanford-Burnham Medical Research Institute (SBMRI, San Diego, CA) NIH Molecular Libraries Screen...
In DepthDetails PCBioAssay
TargetEphrin type-A receptor 4(Mus musculus)
Burnham Center For Chemical Genomics
Curated by PubChem BioAssay
LigandPNGBDBM44509(1,2-dimethoxy-9-thioxanthenone | 1,2-dimethoxy-9H-...)
Affinity DataIC50: >1.00E+5nM. Assay description: Data Source: Sanford-Burnham Center for Chemical Genomics (SBCCG) Source Affiliation: Sanford-Burnham Medical Research Institute (SBMRI, San Diego, C...
In DepthDetails PCBioAssay