BDBM44515 2-[(4-fluoroanilino)carbamoyl]benzoic acid::2-[[(4-fluorophenyl)amino]carbamoyl]benzoic acid::2-[[(4-fluorophenyl)hydrazo]-oxomethyl]benzoic acid::2-{[2-(4-fluorophenyl)hydrazino]carbonyl}benzenecarboxylic acid::MLS000327994::SMR000168599::cid_2769287
SMILES OC(=O)c1ccccc1C(=O)NNc1ccc(F)cc1
InChI Key InChIKey=NVOSYLGKHYETHC-UHFFFAOYSA-N
Data  2 IC50
  Tab Delimited (TSV)   2D SDfile   Computed 3D by Vconf -m prep SDfile
Find this compound or compounds like it in BindingDB:
Activity Spreadsheet -- Enzyme Inhibition Constant Data from BindingDB
Found 2 hits for monomerid = 44515
TargetEphrin type-A receptor 4(Mus musculus)
Burnham Center For Chemical Genomics
Curated by PubChem BioAssay
LigandPNGBDBM44515(2-[(4-fluoroanilino)carbamoyl]benzoic acid | 2-[[(...)
Affinity DataIC50: >5.00E+4nM. Assay description: Sanford-Burnham Center for Chemical Genomics (SBCCG) Sanford-Burnham Medical Research Institute (SBMRI, San Diego, CA) NIH Molecular Libraries Screen...
In DepthDetails PCBioAssay
TargetEphrin type-A receptor 4(Mus musculus)
Burnham Center For Chemical Genomics
Curated by PubChem BioAssay
LigandPNGBDBM44515(2-[(4-fluoroanilino)carbamoyl]benzoic acid | 2-[[(...)
Affinity DataIC50: >1.00E+5nM. Assay description: Data Source: Sanford-Burnham Center for Chemical Genomics (SBCCG) Source Affiliation: Sanford-Burnham Medical Research Institute (SBMRI, San Diego, C...
In DepthDetails PCBioAssay