BDBM44541 5-(4-Isobutoxy-benzyl)-pyrimidine-2,4-diamine::5-[[4-(2-methylpropoxy)phenyl]methyl]pyrimidine-2,4-diamine::MLS000552195::SMR000145909::[2-amino-5-(4-isobutoxybenzyl)pyrimidin-4-yl]amine::cid_739795
SMILES CC(C)COc1ccc(Cc2cnc(N)nc2N)cc1
InChI Key InChIKey=DNDUAVBKKLSDIM-UHFFFAOYSA-N
Data  1 IC50
  Tab Delimited (TSV)   2D SDfile   Computed 3D by Vconf -m prep SDfile
Find this compound or compounds like it in BindingDB:
Activity Spreadsheet -- Enzyme Inhibition Constant Data from BindingDB
Found 1 hit for monomerid = 44541
TargetProtein Rev [8-24](Human immunodeficiency virus 1)
The Scripps Research Institute Molecular Screening Center
Curated by PubChem BioAssay
LigandPNGBDBM44541(5-(4-Isobutoxy-benzyl)-pyrimidine-2,4-diamine | 5-...)
Affinity DataIC50: >7.94E+4nM. Assay description: Source (MLSCN Center Name): The Scripps Research Institute Molecular Screening Center Center Affiliation: The Scripps Research Institute, TSRI Assay ...
In DepthDetails PCBioAssay