BDBM44628 MLS000057683::N-(5-ethyl-1,3,4-thiadiazol-2-yl)-1-(4-methylphenyl)sulfonyl-2-pyrrolidinecarboxamide::N-(5-ethyl-1,3,4-thiadiazol-2-yl)-1-(4-methylphenyl)sulfonyl-pyrrolidine-2-carboxamide::N-(5-ethyl-1,3,4-thiadiazol-2-yl)-1-(4-methylphenyl)sulfonylpyrrolidine-2-carboxamide::N-(5-ethyl-1,3,4-thiadiazol-2-yl)-1-tosyl-pyrrolidine-2-carboxamide::SMR000067786::cid_2998221
SMILES CCc1nnc(NC(=O)C2CCCN2S(=O)(=O)c2ccc(C)cc2)s1
InChI Key InChIKey=YHJYRGAKNBBUGA-UHFFFAOYSA-N
Data  1 EC50
  Tab Delimited (TSV)   2D SDfile   Computed 3D by Vconf -m prep SDfile
Find this compound or compounds like it in BindingDB:
Activity Spreadsheet -- Enzyme Inhibition Constant Data from BindingDB
Found 1 hit for monomerid = 44628
TargetMultidrug resistance-associated protein 1(Homo sapiens (Human))
Srmlsc
Curated by PubChem BioAssay
LigandPNGBDBM44628(MLS000057683 | N-(5-ethyl-1,3,4-thiadiazol-2-yl)-1...)
Affinity DataEC50:  5.60E+3nM. Assay description: Southern Research Molecular Libraries Screening Center (SRMLSC) Southern Research Institute (Birmingham, Alabama) NIH Molecular Libraries Screening C...
In DepthDetails PCBioAssay