BDBM44677 MLS000063204::N-(5-benzyl-1,3,4-thiadiazol-2-yl)methanesulfonamide::N-[5-(phenylmethyl)-1,3,4-thiadiazol-2-yl]methanesulfonamide::SMR000074729::cid_855323
SMILES CS(=O)(=O)Nc1nnc(Cc2ccccc2)s1
InChI Key InChIKey=YYCJAVKLZPRSRN-UHFFFAOYSA-N
Data  1 EC50
  Tab Delimited (TSV)   2D SDfile   Computed 3D by Vconf -m prep SDfile
Find this compound or compounds like it in BindingDB:
Activity Spreadsheet -- Enzyme Inhibition Constant Data from BindingDB
Found 1 hit for monomerid = 44677
TargetMultidrug resistance-associated protein 1(Homo sapiens (Human))
Srmlsc
Curated by PubChem BioAssay
LigandPNGBDBM44677(MLS000063204 | N-(5-benzyl-1,3,4-thiadiazol-2-yl)m...)
Affinity DataEC50:  4.04E+3nM. Assay description: Southern Research Molecular Libraries Screening Center (SRMLSC) Southern Research Institute (Birmingham, Alabama) NIH Molecular Libraries Screening C...
In DepthDetails PCBioAssay