BDBM44763 3-phenyl-N-(5-tetralin-6-yl-1,3,4-oxadiazol-2-yl)propionamide::3-phenyl-N-[5-(5,6,7,8-tetrahydronaphthalen-2-yl)-1,3,4-oxadiazol-2-yl]propanamide::MLS000101534::SMR000018510::cid_4144189
SMILES O=C(CCc1ccccc1)Nc1nnc(o1)-c1ccc2CCCCc2c1
InChI Key InChIKey=UAAGRYJYIMQKAI-UHFFFAOYSA-N
Data  2 EC50
  Tab Delimited (TSV)   2D SDfile   Computed 3D by Vconf -m prep SDfile
Find this compound or compounds like it in BindingDB:
Activity Spreadsheet -- Enzyme Inhibition Constant Data from BindingDB
Found 2 hits for monomerid = 44763
TargetStreptokinase A(Streptococcus pyogenes M1 GAS)
Broad Institute
Curated by PubChem BioAssay
LigandPNGBDBM44763(3-phenyl-N-(5-tetralin-6-yl-1,3,4-oxadiazol-2-yl)p...)
Affinity DataEC50:  1.50E+5nM. Assay description: Keywords: Group A streptococcus, GAS, streptokinase, expression, virulence, inhibition, dose response, EC50 Assay Overview: The goal of this assa...
In DepthDetails PCBioAssay
TargetMultidrug resistance-associated protein 1(Homo sapiens (Human))
Srmlsc
Curated by PubChem BioAssay
LigandPNGBDBM44763(3-phenyl-N-(5-tetralin-6-yl-1,3,4-oxadiazol-2-yl)p...)
Affinity DataEC50:  1.36E+3nM. Assay description: Southern Research Molecular Libraries Screening Center (SRMLSC) Southern Research Institute (Birmingham, Alabama) NIH Molecular Libraries Screening C...
In DepthDetails PCBioAssay