BDBM448349 Perampanel, 5
SMILES CCCOc1cc(Cl)cc(c1)C1C=C(C(=O)N(C1=O)c1cccnc1)c1ccccc1C#N
InChI Key InChIKey=OWQNFRYCFVOJPQ-UHFFFAOYSA-N
Data  1 IC50  2 EC50
  Tab Delimited (TSV)   2D SDfile   Computed 3D by Vconf -m prep SDfile
Find this compound or compounds like it in BindingDB:
Activity Spreadsheet -- Enzyme Inhibition Constant Data from BindingDB
Found 3 hits for monomerid = 448349
TargetReplicase polyprotein 1ab(2019-nCoV)
Yale University
LigandPNGBDBM448349(Perampanel, 5)
Affinity DataIC50:  140nM. Assay description: Inhibition of proteolytic activity was tested using recombinant SARS-CoV-2Mpro, which was expressed and purified as previously described.8,12 For the...
Ligand InfoPC cidPC sid
In DepthDetails Article
TargetReplicase polyprotein 1ab(2019-nCoV)
Yale University
LigandPNGBDBM448349(Perampanel, 5)
Affinity DataEC50:  1.50E+3nM. Assay description: Vero-E6 cells were seeded at 4 x 10E5 cells/well in 12-well plates and infected for 1 hour with the SARS-CoV-2 isolate USA-WA1/2020 at an MOI of 0.01...
Ligand InfoPC cidPC sid
In DepthDetails Article
TargetReplicase polyprotein 1ab(2019-nCoV)
Yale University
LigandPNGBDBM448349(Perampanel, 5)
Affinity DataEC50:  2.50E+3nM. Assay description: The antiviral activity of compounds was examined by evaluating the cytopathic effect in Vero-E6 cells grown at 37°C in a 5% CO2 atmosphere for 72 h u...
Ligand InfoPC cidPC sid
In DepthDetails Article