BDBM448366 Perampanel, 18::Perampanel, 19
SMILES Fc1ccccc1COc1cc(Cl)cc(c1)C1C=C(C(=O)N(C1=O)c1cccnc1)c1c[nH]c(=O)[nH]c1=O
InChI Key
Data  2 IC50
  Tab Delimited (TSV)   2D SDfile   Computed 3D by Vconf -m prep SDfile
Find this compound or compounds like it in BindingDB:
Activity Spreadsheet -- Enzyme Inhibition Constant Data from BindingDB
Found 2 hits for monomerid = 448366
TargetReplicase polyprotein 1ab(2019-nCoV)
Yale University
LigandPNGBDBM448366(Perampanel, 18 | Perampanel, 19)
Affinity DataIC50:  37nM. Assay description: Inhibition of proteolytic activity was tested using recombinant SARS-CoV-2Mpro, which was expressed and purified as previously described.8,12 For the...
Ligand InfoPC cidPC sid
In DepthDetails Article
TargetReplicase polyprotein 1ab(2019-nCoV)
Yale University
LigandPNGBDBM448366(Perampanel, 18 | Perampanel, 19)
Affinity DataIC50:  24nM. Assay description: Inhibition of proteolytic activity was tested using recombinant SARS-CoV-2Mpro, which was expressed and purified as previously described.8,12 For the...
Ligand InfoPC cidPC sid
In DepthDetails Article