BDBM448371 Perampanel, 23
SMILES Fc1c(Cl)cc(cc1OCc1ccccc1Cl)C1C=C(C(=O)N(C1=O)c1cccnc1)c1c[nH]c(=O)[nH]c1=O
InChI Key
Data  1 IC50  1 EC50
  Tab Delimited (TSV)   2D SDfile   Computed 3D by Vconf -m prep SDfile
Find this compound or compounds like it in BindingDB:
Activity Spreadsheet -- Enzyme Inhibition Constant Data from BindingDB
Found 2 hits for monomerid = 448371
TargetReplicase polyprotein 1ab(2019-nCoV)
Yale University
LigandPNGBDBM448371(Perampanel, 23)
Affinity DataEC50:  840nM. Assay description: Vero-E6 cells were seeded at 4 x 10E5 cells/well in 12-well plates and infected for 1 hour with the SARS-CoV-2 isolate USA-WA1/2020 at an MOI of 0.01...
Ligand InfoPC cidPC sid
In DepthDetails Article
TargetReplicase polyprotein 1ab(2019-nCoV)
Yale University
LigandPNGBDBM448371(Perampanel, 23)
Affinity DataIC50:  20nM. Assay description: Inhibition of proteolytic activity was tested using recombinant SARS-CoV-2Mpro, which was expressed and purified as previously described.8,12 For the...
Ligand InfoPC cidPC sid
In DepthDetails Article