BDBM448455 US10695347, Compound I-82
SMILES CC(C)Oc1cc(ccc1Nc1ncc(Cl)c(Nc2ccsc2S(=O)(=O)C(C)C)n1)N1CCC(CC1)N(C)C
InChI Key InChIKey=NONIQRKACDVSIB-UHFFFAOYSA-N
Data  2 IC50
  Tab Delimited (TSV)   2D SDfile   Computed 3D by Vconf -m prep SDfile
Find this compound or compounds like it in BindingDB:
Activity Spreadsheet -- Enzyme Inhibition Constant Data from BindingDB
Found 2 hits for monomerid = 448455
TargetALK tyrosine kinase receptor [L1196M](Homo sapiens (Human))
Hubei Bio-Pharmaceutical Industrial Technological Institute
US Patent
LigandPNGBDBM448455(US10695347, Compound I-82)
Affinity DataIC50: <1nM. Assay description: 1× Kinase Buffer 50 mM HEPES. pH 7.5 0.0015% Brij-35 10 mM MgCl2 2 mM DTT 2) stop buffer 100 mM HEPES, pH 7...
Ligand InfoPC cidPC sid
In DepthDetails US Patent
TargetALK tyrosine kinase receptor(Homo sapiens (Human))
Hubei Bio-Pharmaceutical Industrial Technological Institute
US Patent
LigandPNGBDBM448455(US10695347, Compound I-82)
Affinity DataIC50: <1nM. Assay description: 1× Kinase Buffer 50 mM HEPES. pH 7.5 0.0015% Brij-35 10 mM MgCl2 2 mM DTT 2) stop buffer 100 mM HEPES, pH 7...
Ligand InfoPC cidPC sid
In DepthDetails US Patent