BDBM45008 4-[(5Z)-4-keto-5-(4-methylbenzylidene)-2-thioxo-thiazolidin-3-yl]-N-(2-pyridyl)butyramide::4-[(5Z)-5-[(4-methylphenyl)methylidene]-4-oxidanylidene-2-sulfanylidene-1,3-thiazolidin-3-yl]-N-pyridin-2-yl-butanamide::4-[(5Z)-5-[(4-methylphenyl)methylidene]-4-oxo-2-sulfanylidene-1,3-thiazolidin-3-yl]-N-pyridin-2-ylbutanamide::4-[(5Z)-5-[(4-methylphenyl)methylidene]-4-oxo-2-sulfanylidene-3-thiazolidinyl]-N-(2-pyridinyl)butanamide::4-[5-(4-methylbenzylidene)-4-oxo-2-thioxo-1,3-thiazolidin-3-yl]-N-2-pyridinylbutanamide::MLS000574019::SMR000195607::cid_1345238
SMILES Cc1ccc(\C=C2/SC(=S)N(CCCC(=O)Nc3ccccn3)C2=O)cc1
InChI Key InChIKey=CMRCYZLRSDSGMN-SSZFMOIBSA-N
Data  4 IC50  2 EC50
  Tab Delimited (TSV)   2D SDfile   Computed 3D by Vconf -m prep SDfile
Find this compound or compounds like it in BindingDB:
Activity Spreadsheet -- Enzyme Inhibition Constant Data from BindingDB
Found 6 hits for monomerid = 45008
TargetMultidrug resistance-associated protein 1(Homo sapiens (Human))
Srmlsc
Curated by PubChem BioAssay
LigandPNGBDBM45008(4-[(5Z)-4-keto-5-(4-methylbenzylidene)-2-thioxo-th...)
Affinity DataEC50:  4.44E+3nM. Assay description: Southern Research Molecular Libraries Screening Center (SRMLSC) Southern Research Institute (Birmingham, Alabama) NIH Molecular Libraries Screening C...
In DepthDetails PCBioAssay
TargetHeat shock protein HSP 90-alpha(Homo sapiens (Human))
The Scripps Research Institute Molecular Screening Center
Curated by PubChem BioAssay
LigandPNGBDBM45008(4-[(5Z)-4-keto-5-(4-methylbenzylidene)-2-thioxo-th...)
Affinity DataIC50:  1.78E+4nM. Assay description: Source (MLPCN Center Name): The Scripps Research Institute Molecular Screening Center (SRIMSC) Center Affiliation: The Scripps Research Institute (TS...
In DepthDetails PCBioAssay
TargetDNA damage-inducible transcript 3 protein(Mus musculus)
Emory University
Curated by PubChem BioAssay
LigandPNGBDBM45008(4-[(5Z)-4-keto-5-(4-methylbenzylidene)-2-thioxo-th...)
Affinity DataIC50:  1.10E+3nM. Assay description: NIH Molecular Libraries Screening Centers Network [MLSCN] Emory Chemical Biology Discovery Center in MLSCN Assay provider: Dr. Randal Kaufman, Univer...
In DepthDetails PCBioAssay
TargetDNA damage-inducible transcript 3 protein(Mus musculus)
Emory University
Curated by PubChem BioAssay
LigandPNGBDBM45008(4-[(5Z)-4-keto-5-(4-methylbenzylidene)-2-thioxo-th...)
Affinity DataIC50:  1.10E+3nM. Assay description: NIH Molecular Libraries Screening Centers Network [MLSCN] Emory Chemical Biology Discovery Center in MLSCN Assay provider: Dr. Randal Kaufman, Univer...
In DepthDetails PCBioAssay
TargetX-box-binding protein 1(Homo sapiens (Human))
Emory University
Curated by PubChem BioAssay
LigandPNGBDBM45008(4-[(5Z)-4-keto-5-(4-methylbenzylidene)-2-thioxo-th...)
Affinity DataIC50:  370nM. Assay description: NIH Molecular Libraries Screening Centers Network [MLSCN] Emory Chemical Biology Discovery Center in MLSCN Assay provider: Dr. Randal Kaufman, Univer...
In DepthDetails PCBioAssay
TargetHeat shock factor protein 1(Mus musculus)
Broad Institute
Curated by PubChem BioAssay
LigandPNGBDBM45008(4-[(5Z)-4-keto-5-(4-methylbenzylidene)-2-thioxo-th...)
Affinity DataEC50:  1.51E+3nM. Assay description: Keywords: Heat Shock Factor-1 (HSF-1), Stress Response, MG132, NIH3T3, Luminescence Assay Overview: Modified NIH3T3, transformed to express firefly...
In DepthDetails PCBioAssay