BDBM451354 US10709709, Example 184::US10709709, Example 185
SMILES CC1Cc2cccc(O[C@H]3C[C@H]([C@H](O)[C@@H]3O)n3ccc4c(C)ncnc34)c2CN1
InChI Key InChIKey=QJPYXSBHEFIHHX-XWEVWCRHSA-N
Data  2 IC50
  Tab Delimited (TSV)   2D SDfile   Computed 3D by Vconf -m prep SDfile
Find this compound or compounds like it in BindingDB:
Activity Spreadsheet -- Enzyme Inhibition Constant Data from BindingDB
Found 2 hits for monomerid = 451354
TargetProtein arginine N-methyltransferase 5(Homo sapiens (Human))
Pfizer
US Patent
LigandPNGBDBM451354(US10709709, Example 184 | US10709709, Example 185)
Affinity DataIC50:  6nM. Assay description: Compounds were solubilized in DMSO and serially diluted, using 3-fold dilutions, into 100% DMSO at a concentration 50-fold greater than the desired a...
Ligand InfoPC cidPC sid
In DepthDetails US Patent
TargetProtein arginine N-methyltransferase 5(Homo sapiens (Human))
Pfizer
US Patent
LigandPNGBDBM451354(US10709709, Example 184 | US10709709, Example 185)
Affinity DataIC50:  1nM. Assay description: Compounds were solubilized in DMSO and serially diluted, using 3-fold dilutions, into 100% DMSO at a concentration 50-fold greater than the desired a...
Ligand InfoPC cidPC sid
In DepthDetails US Patent