BDBM451361 US10709709, Example 191
SMILES COc1nc(O[C@H]2C[C@H]([C@H](O)[C@@H]2O)n2ccc3c(C)ncnc23)c2CNCCc2c1F
InChI Key InChIKey=DMZQGRWRRDDJBQ-MXSMSXNCSA-N
Data  1 IC50
  Tab Delimited (TSV)   2D SDfile   Computed 3D by Vconf -m prep SDfile
Find this compound or compounds like it in BindingDB:
Activity Spreadsheet -- Enzyme Inhibition Constant Data from BindingDB
Found 1 hit for monomerid = 451361
TargetProtein arginine N-methyltransferase 5(Homo sapiens (Human))
Pfizer
US Patent
LigandPNGBDBM451361(US10709709, Example 191)
Affinity DataIC50:  1nM. Assay description: Compounds were solubilized in DMSO and serially diluted, using 3-fold dilutions, into 100% DMSO at a concentration 50-fold greater than the desired a...
Ligand InfoPC cidPC sid
In DepthDetails US Patent