BDBM4527 4-Phenylamino-3-quinolinecarbonitrile deriv. 1e::4-[(2,4-Dichloro-5-propoxyphenyl)amino]-6,7-dimethoxy-3-quinolinecarbonitrile::4-[(2,4-dichloro-5-propoxyphenyl)amino]-6,7-dimethoxyquinoline-3-carbonitrile
SMILES CCCOc1cc(Nc2c(cnc3cc(OC)c(OC)cc23)C#N)c(Cl)cc1Cl
InChI Key InChIKey=SVBIASBVODEZOL-UHFFFAOYSA-N
Data  1 IC50
  Tab Delimited (TSV)   2D SDfile   Computed 3D by Vconf -m prep SDfile
Find this compound or compounds like it in BindingDB:
Activity Spreadsheet -- Enzyme Inhibition Constant Data from BindingDB
Found 1 hit for monomerid = 4527
TargetProto-oncogene tyrosine-protein kinase Src(Homo sapiens (Human))
Wyeth-Ayerst Research
LigandPNGBDBM4527(4-Phenylamino-3-quinolinecarbonitrile deriv. 1e | ...)
Affinity DataIC50: >5.00E+3nMpH: 7.5 T: 2°C. Assay description: Src kinase activity was measured in an ELISA format. IC50 is the inhibitor concentration which inhibits 50% of kinase activity that catalyzes the tra...
In DepthDetails ArticlePubMed