BDBM45316 MLS000027598::SMR000040012::[2-phenyl-4-(pyridin-2-yliminomethyl)-1,3-oxazol-5-yl] acetate::[2-phenyl-4-(pyridin-2-yliminomethyl)-1,3-oxazol-5-yl] ethanoate::acetic acid [2-phenyl-4-(2-pyridinyliminomethyl)-5-oxazolyl] ester::acetic acid [2-phenyl-4-(2-pyridyliminomethyl)oxazol-5-yl] ester::cid_659050
SMILES CC(=O)Oc1oc(nc1C=Nc1ccccn1)-c1ccccc1
InChI Key InChIKey=CLQYYXUSAQGRMT-UHFFFAOYSA-N
Data  2 IC50
  Tab Delimited (TSV)   2D SDfile   Computed 3D by Vconf -m prep SDfile
Find this compound or compounds like it in BindingDB:
Activity Spreadsheet -- Enzyme Inhibition Constant Data from BindingDB
Found 2 hits for monomerid = 45316
TargetTyrosine-protein phosphatase non-receptor type 7(Homo sapiens (Human))
Burnham Center For Chemical Genomics
Curated by PubChem BioAssay
LigandPNGBDBM45316(MLS000027598 | SMR000040012 | [2-phenyl-4-(pyridin...)
Affinity DataIC50:  1.00E+5nM. Assay description: Data Source: Sanford-Burnham Center for Chemical Genomics (SBCCG) Source Affiliation: Sanford-Burnham Medical Research Institute (SBMRI, San Diego, C...
In DepthDetails PCBioAssay
TargetCoagulation factor XII(Homo sapiens (Human))
Pcmd
Curated by PubChem BioAssay
LigandPNGBDBM45316(MLS000027598 | SMR000040012 | [2-phenyl-4-(pyridin...)
Affinity DataIC50:  1.64E+4nM. Assay description: Molecular Library Screening Center Network (MLSCN) Penn Center for Molecular Discovery (PCMD) Assay Provider: Scott L. Diamond, University of Pennsy...
In DepthDetails PCBioAssay