BDBM45763 AB00540124::N-(cyclopropylmethyl)-4-(3-keto-1,2-benzothiazol-2-yl)benzamide::N-(cyclopropylmethyl)-4-(3-oxidanylidene-1,2-benzothiazol-2-yl)benzamide::N-(cyclopropylmethyl)-4-(3-oxo-1,2-benzothiazol-2-yl)benzamide::cid_16749987
SMILES O=C(NCC1CC1)c1ccc(cc1)-n1sc2ccccc2c1=O
InChI Key InChIKey=YQXQCHCUTISHOI-UHFFFAOYSA-N
Data  1 IC50
  Tab Delimited (TSV)   2D SDfile   Computed 3D by Vconf -m prep SDfile
Find this compound or compounds like it in BindingDB:
Activity Spreadsheet -- Enzyme Inhibition Constant Data from BindingDB
Found 1 hit for monomerid = 45763
TargetDiphosphomevalonate decarboxylase(Streptococcus pneumoniae D39)
Srmlsc
Curated by PubChem BioAssay
LigandPNGBDBM45763(AB00540124 | N-(cyclopropylmethyl)-4-(3-keto-1,2-b...)
Affinity DataIC50:  748nM. Assay description: Southern Research Molecular Libraries Screening Center (SRMLSC) Southern Research Institute (Birmingham, Alabama) NIH Molecular Libraries Screening...
In DepthDetails PCBioAssay