BDBM458387 1-[2-[(3R,5S)-1-[(1S)-1-(6-fluoro-2-methyl-1,3-benzothiazol-5-yl)ethyl]-5-methyl-pyrrolidin-3-yl]oxy-5,7-dihydropyrrolo[3,4-b]pyridin-6-yl]ethanone::US10752632, Example 6::US10836773, Example 6
SMILES C[C@H](N1C[C@@H](C[C@@H]1C)Oc1ccc2CN(Cc2n1)C(C)=O)c1cc2nc(C)sc2cc1F
InChI Key InChIKey=RRZMDTAIYFPMKV-SUNYJGFJSA-N
Data  3 IC50
  Tab Delimited (TSV)   2D SDfile   Computed 3D by Vconf -m prep SDfile
Find this compound or compounds like it in BindingDB:
Activity Spreadsheet -- Enzyme Inhibition Constant Data from BindingDB
Found 3 hits for monomerid = 458387
TargetProtein O-GlcNAcase(Homo sapiens (Human))
Eli Lilly
US Patent
LigandPNGBDBM458387(1-[2-[(3R,5S)-1-[(1S)-1-(6-fluoro-2-methyl-1,3-ben...)
Affinity DataIC50:  0.385nM. Assay description: The OGA enzyme catalyses the removal of O-GlcNAc from nucleocytoplasmic proteins. To measure this activity Fluorescein di-N-acetyl-β-N-acetyl-D-...
Ligand InfoPC cidPC sid
In DepthDetails US Patent
TargetProtein O-GlcNAcase(Homo sapiens (Human))
Eli Lilly
US Patent
LigandPNGBDBM458387(1-[2-[(3R,5S)-1-[(1S)-1-(6-fluoro-2-methyl-1,3-ben...)
Affinity DataIC50:  0.385nM. Assay description: Inhibition of full-length human N-terminal poly-His tagged OGA expressed in baculovirus infected Sf9 cells using FD-GlcNAc as substrate preincubated ...
Ligand InfoPC cidPC sid
In DepthDetails ArticlePubMed
TargetProtein O-GlcNAcase(Homo sapiens (Human))
Eli Lilly
US Patent
LigandPNGBDBM458387(1-[2-[(3R,5S)-1-[(1S)-1-(6-fluoro-2-methyl-1,3-ben...)
Affinity DataIC50:  0.385nM. Assay description: The OGA enzyme catalyses the removal of O-GlcNAc from nucleocytoplasmic proteins. To measure this activity Fluorescein di-N-acetyl-β-N-acetyl-D-...
Ligand InfoPC cidPC sid
In DepthDetails US Patent