BDBM459205 2-[1-[2-[[(3aR,6aS)-5-fluoro-1,2,3,3a,4,5,6,6a-octahydropentalen-2-yl]oxy]-2-(2-methoxyphenyl)ethyl)-5-methyl-6-oxazol-2-yl-2,4-dioxo-thieno[2,3-d]pyrimid-3-yl]-2-methyl-propanoic acid::US10759812, Example 17
SMILES COc1ccccc1C(Cn1c2sc(c(C)c2c(=O)n(c1=O)C(C)(C)C(O)=O)-c1ncco1)O[C@@H]1C[C@@H]2C[C@@H](F)C[C@@H]2C1
InChI Key InChIKey=PRIBVYHNGZCJEI-JSLJGZGYSA-N
Data  1 IC50
  Tab Delimited (TSV)   2D SDfile   Computed 3D by Vconf -m prep SDfile
Find this compound or compounds like it in BindingDB:
Activity Spreadsheet -- Enzyme Inhibition Constant Data from BindingDB
Found 1 hit for monomerid = 459205
TargetAcetyl-CoA carboxylase 1(Homo sapiens (Human))
Sunshine Lake Pharma
US Patent
LigandPNGBDBM459205(2-[1-[2-[[(3aR,6aS)-5-fluoro-1,2,3,3a,4,5,6,6a-oct...)
Affinity DataIC50:  2.24nM. Assay description:  a. 4.5 μL/well of ACC1/ACC2 working solution (2.22 nM) was added to a 384-well reaction plate (PerkinElmer, 6007290). b. The comp...
Ligand InfoPC cidPC sid
In DepthDetails US Patent