BDBM46088 1-(3,4-dihydroxyphenyl)-2-[(5-methyl-1H-pyrazol-3-yl)amino]ethanone::1-[3,4-bis(oxidanyl)phenyl]-2-[(5-methyl-1H-pyrazol-3-yl)amino]ethanone::MLS-0390946.0001::cid_25199539
SMILES Cc1cc(NCC(=O)c2ccc(O)c(O)c2)[nH]n1
InChI Key InChIKey=LHXYNDSGEDISEA-UHFFFAOYSA-N
Data  2 IC50
  Tab Delimited (TSV)   2D SDfile   Computed 3D by Vconf -m prep SDfile
Find this compound or compounds like it in BindingDB:
Activity Spreadsheet -- Enzyme Inhibition Constant Data from BindingDB
Found 2 hits for monomerid = 46088
TargetAlkaline phosphatase, germ cell type(Homo sapiens (Human))
Burnham Center For Chemical Genomics
Curated by PubChem BioAssay
LigandPNGBDBM46088(1-(3,4-dihydroxyphenyl)-2-[(5-methyl-1H-pyrazol-3-...)
Affinity DataIC50:  5.71E+3nM. Assay description: Data Source: Sanford-Burnham Center for Chemical Genomics (SBCCG) Source Affiliation: Sanford-Burnham Medical Research Institute (SBMRI, San Diego, C...
Ligand InfoPC cidPC sid
In DepthDetails PCBioAssay
TargetAlkaline phosphatase, tissue-nonspecific isozyme(Homo sapiens (Human))
Burnham Center For Chemical Genomics
Curated by PubChem BioAssay
LigandPNGBDBM46088(1-(3,4-dihydroxyphenyl)-2-[(5-methyl-1H-pyrazol-3-...)
Affinity DataIC50:  1.83E+4nM. Assay description: Sanford-Burnham Center for Chemical Genomics (SBCCG) Sanford-Burnham Medical Research Institute (SBMRI, San Diego, CA) NIH Molecular Libraries Screen...
Ligand InfoPC cidPC sid
In DepthDetails PCBioAssay