BDBM46102 4-[(6-hydroxy-2,4-diketo-1H-pyrimidine-5-carbonyl)amino]benzoic acid butyl ester::4-[[(6-hydroxy-2,4-dioxo-1H-pyrimidin-5-yl)-oxomethyl]amino]benzoic acid butyl ester::UPDDI-00294854::butyl 4-[(6-hydroxy-2,4-dioxo-1H-pyrimidine-5-carbonyl)amino]benzoate::butyl 4-[[6-oxidanyl-2,4-bis(oxidanylidene)-1H-pyrimidin-5-yl]carbonylamino]benzoate::cid_16654014
SMILES CCCCOC(=O)c1ccc(NC(=O)c2c(O)[nH]c(=O)[nH]c2=O)cc1
InChI Key InChIKey=MOCMXBAACSSMQG-UHFFFAOYSA-N
Data  1 IC50
  Tab Delimited (TSV)   2D SDfile   Computed 3D by Vconf -m prep SDfile
Find this compound or compounds like it in BindingDB:
Activity Spreadsheet -- Enzyme Inhibition Constant Data from BindingDB
Found 1 hit for monomerid = 46102
TargetSerine/threonine-protein kinase PLK1(Homo sapiens (Human))
University Of Pittsburgh
Curated by PubChem BioAssay
LigandPNGBDBM46102(4-[(6-hydroxy-2,4-diketo-1H-pyrimidine-5-carbonyl)...)
Affinity DataIC50: >5.00E+4nM. Assay description: List of compounds to be tested: 33 component starting materials and chemical analogs of the hits identified in the in vitro PLK1-PBD binding primary ...
In DepthDetails PCBioAssay