BDBM46124 2,4-difluoro-N-p-phenetyl-benzamide::N-(4-ethoxyphenyl)-2,4-bis(fluoranyl)benzamide::N-(4-ethoxyphenyl)-2,4-difluorobenzamide::UPDDI-00398627::cid_7733204
SMILES CCOc1ccc(NC(=O)c2ccc(F)cc2F)cc1
InChI Key InChIKey=QIZDAQGDNGATPS-UHFFFAOYSA-N
Data  1 IC50
  Tab Delimited (TSV)   2D SDfile   Computed 3D by Vconf -m prep SDfile
Find this compound or compounds like it in BindingDB:
Activity Spreadsheet -- Enzyme Inhibition Constant Data from BindingDB
Found 1 hit for monomerid = 46124
TargetSerine/threonine-protein kinase PLK1(Homo sapiens (Human))
University Of Pittsburgh
Curated by PubChem BioAssay
LigandPNGBDBM46124(2,4-difluoro-N-p-phenetyl-benzamide | N-(4-ethoxyp...)
Affinity DataIC50: >5.00E+4nM. Assay description: List of compounds to be tested: 33 component starting materials and chemical analogs of the hits identified in the in vitro PLK1-PBD binding primary ...
In DepthDetails PCBioAssay