BDBM46127 4-[(2,4-difluorobenzoyl)amino]benzoic acid butyl ester::4-[[(2,4-difluorophenyl)-oxomethyl]amino]benzoic acid butyl ester::UPDDI-00398630::butyl 4-[(2,4-difluorobenzoyl)amino]benzoate::butyl 4-[[2,4-bis(fluoranyl)phenyl]carbonylamino]benzoate::cid_7760837
SMILES CCCCOC(=O)c1ccc(NC(=O)c2ccc(F)cc2F)cc1
InChI Key InChIKey=MSRUJIZBTMYBHB-UHFFFAOYSA-N
Data  1 IC50
  Tab Delimited (TSV)   2D SDfile   Computed 3D by Vconf -m prep SDfile
Find this compound or compounds like it in BindingDB:
Activity Spreadsheet -- Enzyme Inhibition Constant Data from BindingDB
Found 1 hit for monomerid = 46127
TargetSerine/threonine-protein kinase PLK1(Homo sapiens (Human))
University Of Pittsburgh
Curated by PubChem BioAssay
LigandPNGBDBM46127(4-[(2,4-difluorobenzoyl)amino]benzoic acid butyl e...)
Affinity DataIC50: >5.00E+4nM. Assay description: List of compounds to be tested: 33 component starting materials and chemical analogs of the hits identified in the in vitro PLK1-PBD binding primary ...
In DepthDetails PCBioAssay