BDBM46216 MLS-0412043.0001::[1-[2-(4-fluoranylphenoxy)ethyl]indol-3-yl]-piperidin-1-yl-methanethione::[1-[2-(4-fluorophenoxy)ethyl]-3-indolyl]-(1-piperidinyl)methanethione::[1-[2-(4-fluorophenoxy)ethyl]indol-3-yl]-piperidin-1-ylmethanethione::[1-[2-(4-fluorophenoxy)ethyl]indol-3-yl]-piperidino-methanethione::cid_1006495
SMILES Fc1ccc(OCCn2cc(C(=S)N3CCCCC3)c3ccccc23)cc1
InChI Key InChIKey=URJMTZFKXDYQBB-UHFFFAOYSA-N
Data  4 IC50
  Tab Delimited (TSV)   2D SDfile   Computed 3D by Vconf -m prep SDfile
Find this compound or compounds like it in BindingDB:
Activity Spreadsheet -- Enzyme Inhibition Constant Data from BindingDB
Found 4 hits for monomerid = 46216
TargetTyrosine-protein phosphatase non-receptor type 7(Homo sapiens (Human))
Burnham Center For Chemical Genomics
Curated by PubChem BioAssay
LigandPNGBDBM46216(MLS-0412043.0001 | [1-[2-(4-fluoranylphenoxy)ethyl...)
Affinity DataIC50: >1.00E+5nM. Assay description: Data Source: Sanford-Burnham Center for Chemical Genomics (SBCCG) Source Affiliation: Sanford-Burnham Medical Research Institute (SBMRI, San Diego, C...
In DepthDetails PCBioAssay
TargetTyrosine-protein phosphatase non-receptor type 7(Homo sapiens (Human))
Burnham Center For Chemical Genomics
Curated by PubChem BioAssay
LigandPNGBDBM46216(MLS-0412043.0001 | [1-[2-(4-fluoranylphenoxy)ethyl...)
Affinity DataIC50:  4.72E+4nM. Assay description: Data Source: Sanford-Burnham Center for Chemical Genomics (SBCCG) Source Affiliation: Sanford-Burnham Medical Research Institute (SBMRI, San Diego, C...
In DepthDetails PCBioAssay
TargetDual specificity protein phosphatase 3(Homo sapiens (Human))
Burnham Center For Chemical Genomics
Curated by PubChem BioAssay
LigandPNGBDBM46216(MLS-0412043.0001 | [1-[2-(4-fluoranylphenoxy)ethyl...)
Affinity DataIC50: >1.00E+5nM. Assay description: Data Source: Sanford-Burnham Center for Chemical Genomics (SBCCG) Source Affiliation: Sanford-Burnham Medical Research Institute (SBMRI, San Diego, C...
In DepthDetails PCBioAssay
TargetDual specificity protein phosphatase 3(Homo sapiens (Human))
Burnham Center For Chemical Genomics
Curated by PubChem BioAssay
LigandPNGBDBM46216(MLS-0412043.0001 | [1-[2-(4-fluoranylphenoxy)ethyl...)
Affinity DataIC50: >9.90E+4nM. Assay description: Data Source: Sanford-Burnham Center for Chemical Genomics (SBCCG) Source Affiliation: Sanford-Burnham Medical Research Institute (SBMRI, San Diego, C...
In DepthDetails PCBioAssay