BDBM462674 US10780090, Compound I-28::US10780090, Compound I-28a::US10780090, Compound I-28b::[(1R,2S,4R)-4-{[5-({4-[(R)-(3-chlorophenyl)sulfinyl]-5-methyl-2- thienyl}carbonyl)pyrimidin-4-yl]amino}-2-hydroxycyclopentyl]methyl sulfamate
SMILES C[C@](N)(c1csc(c1)C(=O)c1cncnc1N[C@@H]1C[C@H](COS(N)(=O)=O)[C@@H](O)[C@H]1O)c1cccc(Br)c1
InChI Key InChIKey=PKZKPEKAHPGUEO-BDRLQPNQSA-N
Data  3 IC50
  Tab Delimited (TSV)   2D SDfile   Computed 3D by Vconf -m prep SDfile
Find this compound or compounds like it in BindingDB:
Activity Spreadsheet -- Enzyme Inhibition Constant Data from BindingDB
Found 3 hits for monomerid = 462674
TargetSUMO-activating enzyme subunit 1(Homo sapiens (Human))
Millennium Pharmaceuticals
US Patent
LigandPNGBDBM462674(US10780090, Compound I-28 | US10780090, Compound I...)
Affinity DataIC50: <10nM. Assay description: The SAE enzymatic reaction totals 50 μl and contains 50 mM HEPES Hemisodium (pH 7.5), 0.05% BSA, 5 mM MgCl2, 0.5 μM ATP, 250 μM GSH, 0...
Ligand InfoPC cidPC sid
In DepthDetails US Patent
TargetSUMO-activating enzyme subunit 1(Homo sapiens (Human))
Millennium Pharmaceuticals
US Patent
LigandPNGBDBM462674(US10780090, Compound I-28 | US10780090, Compound I...)
Affinity DataIC50: <10nM. Assay description: The SAE enzymatic reaction totals 50 μl and contains 50 mM HEPES Hemisodium (pH 7.5), 0.05% BSA, 5 mM MgCl2, 0.5 μM ATP, 250 μM GSH, 0...
Ligand InfoPC cidPC sid
In DepthDetails US Patent
TargetSUMO-activating enzyme subunit 1(Homo sapiens (Human))
Millennium Pharmaceuticals
US Patent
LigandPNGBDBM462674(US10780090, Compound I-28 | US10780090, Compound I...)
Affinity DataIC50:  55nM. Assay description: The SAE enzymatic reaction totals 50 μl and contains 50 mM HEPES Hemisodium (pH 7.5), 0.05% BSA, 5 mM MgCl2, 0.5 μM ATP, 250 μM GSH, 0...
Ligand InfoPC cidPC sid
In DepthDetails US Patent