BDBM462699 US10780090, Compound I-41::US10780090, Compound I-41a::US10780090, Compound I-41b::[(1R,2S,4R)-4-{[5-({4-(3-chlorobenzyl)-5-[(2S)-tetrahydrofuran-2-yl]-2- thienyl}carbonyl)pyrimidin-4-yl]amino}-2-hydroxycyclopentyl]methyl sulfamate
SMILES NS(=O)(=O)OC[C@H]1C[C@H](C[C@@H]1O)Nc1ncncc1C(=O)c1cc(Cc2cccc(Cl)c2)c(s1)[C@@H]1CCCO1
InChI Key InChIKey=ZJEUCXUPKVDSFI-IVOMFYJKSA-N
Data  3 IC50
  Tab Delimited (TSV)   2D SDfile   Computed 3D by Vconf -m prep SDfile
Find this compound or compounds like it in BindingDB:
Activity Spreadsheet -- Enzyme Inhibition Constant Data from BindingDB
Found 3 hits for monomerid = 462699
TargetSUMO-activating enzyme subunit 1(Homo sapiens (Human))
Millennium Pharmaceuticals
US Patent
LigandPNGBDBM462699(US10780090, Compound I-41 | US10780090, Compound I...)
Affinity DataIC50: <10nM. Assay description: The SAE enzymatic reaction totals 50 μl and contains 50 mM HEPES Hemisodium (pH 7.5), 0.05% BSA, 5 mM MgCl2, 0.5 μM ATP, 250 μM GSH, 0...
Ligand InfoPC cidPC sid
In DepthDetails US Patent
TargetSUMO-activating enzyme subunit 1(Homo sapiens (Human))
Millennium Pharmaceuticals
US Patent
LigandPNGBDBM462699(US10780090, Compound I-41 | US10780090, Compound I...)
Affinity DataIC50: <10nM. Assay description: The SAE enzymatic reaction totals 50 μl and contains 50 mM HEPES Hemisodium (pH 7.5), 0.05% BSA, 5 mM MgCl2, 0.5 μM ATP, 250 μM GSH, 0...
Ligand InfoPC cidPC sid
In DepthDetails US Patent
TargetSUMO-activating enzyme subunit 1(Homo sapiens (Human))
Millennium Pharmaceuticals
US Patent
LigandPNGBDBM462699(US10780090, Compound I-41 | US10780090, Compound I...)
Affinity DataIC50: <10nM. Assay description: The SAE enzymatic reaction totals 50 μl and contains 50 mM HEPES Hemisodium (pH 7.5), 0.05% BSA, 5 mM MgCl2, 0.5 μM ATP, 250 μM GSH, 0...
Ligand InfoPC cidPC sid
In DepthDetails US Patent